Implement passwords app list

4 jobs for password in 1 minute and 27 seconds (queued for 1 second)
latest
Status Name Job ID Coverage
  Test
passed code_coverage #4994
docker

00:01:17

failed lint_code #4995
docker

00:01:18

failed race_detector #4993
docker

00:01:26

failed unit_tests #4992
docker

00:01:25

 
Name Stage Failure
failed
lint_code Test
	see 'go help modules'
$ make lint
Found 4 lint suggestions; failing.
/go/src/gitlab.bertha.cloud/partitio/Nextcloud-Partitio/gonextcloud/gonextcloud.go:186:6: exported type Passwords should have comment or be unexported
/go/src/gitlab.bertha.cloud/partitio/Nextcloud-Partitio/gonextcloud/password_impl.go:42:6: exported type Password should have comment or be unexported
/go/src/gitlab.bertha.cloud/partitio/Nextcloud-Partitio/gonextcloud/password_impl.go:43:2: struct field Id should be ID
/go/src/gitlab.bertha.cloud/partitio/Nextcloud-Partitio/gonextcloud/password_impl.go:47:2: struct field Url should be URL
make: *** [Makefile:11: lint] Error 1
ERROR: Job failed: exit code 1
failed
race_detector Test
gitlab.bertha.cloud/partitio/Nextcloud-Partitio/gonextcloud.testCreateFolder(0xc0000eee00)
/go/src/gitlab.bertha.cloud/partitio/Nextcloud-Partitio/gonextcloud/webdav_impl_test.go:72 +0x9b
testing.tRunner(0xc0000eee00, 0x9ce258)
/usr/local/go/src/testing/testing.go:865 +0x164
created by testing.(*T).Run
/usr/local/go/src/testing/testing.go:916 +0x65b
FAIL gitlab.bertha.cloud/partitio/Nextcloud-Partitio/gonextcloud 1.337s
make: *** [Makefile:17: race] Error 1
ERROR: Job failed: exit code 1
failed
unit_tests Test
gitlab.bertha.cloud/partitio/Nextcloud-Partitio/gonextcloud.testCreateFolder(0xc00011f200)
/go/src/gitlab.bertha.cloud/partitio/Nextcloud-Partitio/gonextcloud/webdav_impl_test.go:72 +0x59
testing.tRunner(0xc00011f200, 0x7fecf0)
/usr/local/go/src/testing/testing.go:865 +0xc0
created by testing.(*T).Run
/usr/local/go/src/testing/testing.go:916 +0x35a
FAIL gitlab.bertha.cloud/partitio/Nextcloud-Partitio/gonextcloud 0.985s
make: *** [Makefile:14: test] Error 1
ERROR: Job failed: exit code 1