Merge branch 'v2' into 'master'

V2

See merge request !4
4 jobs for master in 2 minutes and 43 seconds (queued for 5 seconds)
Status Name Job ID Coverage
  Test
passed code_coverage #3497
docker

00:00:30

failed lint_code #3498
docker

00:00:38

failed race_detector #3496
docker

00:00:44

failed unit_tests #3495
docker

00:00:51

 
Name Stage Failure
failed
lint_code Test
/go/src/gitlab.bertha.cloud/partitio/Nextcloud-Partitio/gonextcloud/notification.go:5:6: exported type Notification should have comment or be unexported
/go/src/gitlab.bertha.cloud/partitio/Nextcloud-Partitio/gonextcloud/responses.go:122:6: exported type Version should have comment or be unexported
/go/src/gitlab.bertha.cloud/partitio/Nextcloud-Partitio/gonextcloud/shares.go:3:6: exported type ShareType should have comment or be unexported
/go/src/gitlab.bertha.cloud/partitio/Nextcloud-Partitio/gonextcloud/shares.go:4:6: exported type SharePermission should have comment or be unexported
/go/src/gitlab.bertha.cloud/partitio/Nextcloud-Partitio/gonextcloud/shares.go:7:2: exported const UserShare should have comment (or a comment on this block) or be unexported
/go/src/gitlab.bertha.cloud/partitio/Nextcloud-Partitio/gonextcloud/shares.go:20:6: exported type ShareUpdate should have comment or be unexported
/go/src/gitlab.bertha.cloud/partitio/Nextcloud-Partitio/gonextcloud/shares.go:28:6: exported type Share should have comment or be unexported
/go/src/gitlab.bertha.cloud/partitio/Nextcloud-Partitio/gonextcloud/user.go:36:6: exported type Quota should have comment or be unexported
make: *** [Makefile:11: lint] Error 1
failed
race_detector Test
gitlab.bertha.cloud/partitio/Nextcloud-Partitio/gonextcloud.testCreateFolder(0xc00049b300)
/go/src/gitlab.bertha.cloud/partitio/Nextcloud-Partitio/gonextcloud/webdav_impl_test.go:72 +0x9b
testing.tRunner(0xc00049b300, 0x9ce068)
/usr/local/go/src/testing/testing.go:865 +0x164
created by testing.(*T).Run
/usr/local/go/src/testing/testing.go:916 +0x65b
FAIL gitlab.bertha.cloud/partitio/Nextcloud-Partitio/gonextcloud 2.419s
make: *** [Makefile:17: race] Error 1
ERROR: Job failed: exit code 1
failed
unit_tests Test
gitlab.bertha.cloud/partitio/Nextcloud-Partitio/gonextcloud.testCreateFolder(0xc00059ec00)
/go/src/gitlab.bertha.cloud/partitio/Nextcloud-Partitio/gonextcloud/webdav_impl_test.go:72 +0x59
testing.tRunner(0xc00059ec00, 0x7fdb60)
/usr/local/go/src/testing/testing.go:865 +0xc0
created by testing.(*T).Run
/usr/local/go/src/testing/testing.go:916 +0x35a
FAIL gitlab.bertha.cloud/partitio/Nextcloud-Partitio/gonextcloud 1.313s
make: *** [Makefile:14: test] Error 1
ERROR: Job failed: exit code 1