updated README.md, unexported responses types

4 jobs for v2 in 2 minutes and 41 seconds (queued for 2 seconds)
latest
Status Job ID Name Coverage
  Test
passed #3493
docker
code_coverage

00:00:31

failed #3494
docker
lint_code

00:00:37

failed #3492
docker
race_detector

00:00:47

failed #3491
docker
unit_tests

00:00:45

 
Name Stage Failure
failed
lint_code Test
/go/src/gitlab.bertha.cloud/partitio/Nextcloud-Partitio/gonextcloud/responses.go:122:6: exported type Version should have comment or be unexported
/go/src/gitlab.bertha.cloud/partitio/Nextcloud-Partitio/gonextcloud/shares.go:3:6: exported type ShareType should have comment or be unexported
/go/src/gitlab.bertha.cloud/partitio/Nextcloud-Partitio/gonextcloud/shares.go:4:6: exported type SharePermission should have comment or be unexported
/go/src/gitlab.bertha.cloud/partitio/Nextcloud-Partitio/gonextcloud/shares.go:7:2: exported const UserShare should have comment (or a comment on this block) or be unexported
/go/src/gitlab.bertha.cloud/partitio/Nextcloud-Partitio/gonextcloud/shares.go:20:6: exported type ShareUpdate should have comment or be unexported
/go/src/gitlab.bertha.cloud/partitio/Nextcloud-Partitio/gonextcloud/shares.go:28:6: exported type Share should have comment or be unexported
/go/src/gitlab.bertha.cloud/partitio/Nextcloud-Partitio/gonextcloud/user.go:36:6: exported type Quota should have comment or be unexported
Found 19 lint suggestions; failing.
make: *** [Makefile:11: lint] Error 1
failed
race_detector Test
	/go/src/gitlab.bertha.cloud/partitio/Nextcloud-Partitio/gonextcloud/vendor/gitlab.bertha.cloud/adphi/gowebdav/client.go:268 +0xaf
gitlab.bertha.cloud/partitio/Nextcloud-Partitio/gonextcloud.testCreateFolder(0xc00055f200)
/go/src/gitlab.bertha.cloud/partitio/Nextcloud-Partitio/gonextcloud/webdav_impl_test.go:72 +0x9b
testing.tRunner(0xc00055f200, 0x9ce068)
/usr/local/go/src/testing/testing.go:865 +0x164
created by testing.(*T).Run
/usr/local/go/src/testing/testing.go:916 +0x65b
FAIL gitlab.bertha.cloud/partitio/Nextcloud-Partitio/gonextcloud 2.143s
make: *** [Makefile:17: race] Error 1
failed
unit_tests Test
gitlab.bertha.cloud/partitio/Nextcloud-Partitio/gonextcloud.testCreateFolder(0xc000146300)
/go/src/gitlab.bertha.cloud/partitio/Nextcloud-Partitio/gonextcloud/webdav_impl_test.go:72 +0x59
testing.tRunner(0xc000146300, 0x7fdb60)
/usr/local/go/src/testing/testing.go:865 +0xc0
created by testing.(*T).Run
/usr/local/go/src/testing/testing.go:916 +0x35a
FAIL gitlab.bertha.cloud/partitio/Nextcloud-Partitio/gonextcloud 1.563s
make: *** [Makefile:14: test] Error 1
ERROR: Job failed: exit code 1