code restructuration: private implementation

4 jobs for v2 in 3 minutes and 10 seconds (queued for 6 seconds)
Status Job ID Name Coverage
  Test
passed #3489
docker
code_coverage

00:00:33

failed #3490
docker
lint_code

00:00:39

failed #3488
docker
race_detector

00:00:47

failed #3487
docker
unit_tests

00:01:09

 
Name Stage Failure
failed
lint_code Test
/go/src/gitlab.bertha.cloud/partitio/Nextcloud-Partitio/gonextcloud/responses.go:179:6: exported type NotificationResponse should have comment or be unexported
/go/src/gitlab.bertha.cloud/partitio/Nextcloud-Partitio/gonextcloud/shares.go:3:6: exported type ShareType should have comment or be unexported
/go/src/gitlab.bertha.cloud/partitio/Nextcloud-Partitio/gonextcloud/shares.go:4:6: exported type SharePermission should have comment or be unexported
/go/src/gitlab.bertha.cloud/partitio/Nextcloud-Partitio/gonextcloud/shares.go:7:2: exported const UserShare should have comment (or a comment on this block) or be unexported
/go/src/gitlab.bertha.cloud/partitio/Nextcloud-Partitio/gonextcloud/shares.go:20:6: exported type ShareUpdate should have comment or be unexported
/go/src/gitlab.bertha.cloud/partitio/Nextcloud-Partitio/gonextcloud/shares.go:28:6: exported type Share should have comment or be unexported
/go/src/gitlab.bertha.cloud/partitio/Nextcloud-Partitio/gonextcloud/user.go:36:6: exported type Quota should have comment or be unexported
make: *** [Makefile:11: lint] Error 1
ERROR: Job failed: exit code 1
failed
race_detector Test
gitlab.bertha.cloud/partitio/Nextcloud-Partitio/gonextcloud.testCreateFolder(0xc000397700)
/go/src/gitlab.bertha.cloud/partitio/Nextcloud-Partitio/gonextcloud/webdav_impl_test.go:72 +0x9b
testing.tRunner(0xc000397700, 0x9ce068)
/usr/local/go/src/testing/testing.go:865 +0x164
created by testing.(*T).Run
/usr/local/go/src/testing/testing.go:916 +0x65b
FAIL gitlab.bertha.cloud/partitio/Nextcloud-Partitio/gonextcloud 1.621s
make: *** [Makefile:17: race] Error 1
ERROR: Job failed: exit code 1
failed
unit_tests Test
gitlab.bertha.cloud/partitio/Nextcloud-Partitio/gonextcloud.testCreateFolder(0xc0000fe400)
/go/src/gitlab.bertha.cloud/partitio/Nextcloud-Partitio/gonextcloud/webdav_impl_test.go:72 +0x59
testing.tRunner(0xc0000fe400, 0x7fdb60)
/usr/local/go/src/testing/testing.go:865 +0xc0
created by testing.(*T).Run
/usr/local/go/src/testing/testing.go:916 +0x35a
FAIL gitlab.bertha.cloud/partitio/Nextcloud-Partitio/gonextcloud 1.177s
make: *** [Makefile:14: test] Error 1
ERROR: Job failed: exit code 1